BDBM172081 US10155002, Compound 87::US9090562, 87
SMILES CCN(C1CCOCC1)c1cc(cc(C(=O)NCc2c(C)cc(C)[nH]c2=O)c1C)-c1ccc(CN2CCCN(C)CC2)cc1
InChI Key InChIKey=UXDCWOSUHKSTJJ-UHFFFAOYSA-N
Data  4 IC50
  Tab Delimited (TSV)   2D SDfile   Computed 3D by Vconf -m prep SDfile
Find this compound or compounds like it in BindingDB:
Activity Spreadsheet -- Enzyme Inhibition Constant Data from BindingDB
Found 4 hits for monomerid = 172081
TargetHistone-lysine N-methyltransferase EZH2(Homo sapiens (Human))
Epizyme
US Patent
LigandPNGBDBM172081(US10155002, Compound 87 | US9090562, 87)
Affinity DataIC50:  5.68nMT: 2°C. Assay description: The assays were all performed in a buffer consisting of 20 mM bicine (pH=7.6), 0.5 mM DTT, 0.005% BSG and 0.002% Tween20, prepared on the day of use....
In DepthDetails US Patent
TargetHistone-lysine N-methyltransferase EZH2 [Y641F](Homo sapiens (Human))
Epizyme
US Patent
LigandPNGBDBM172081(US10155002, Compound 87 | US9090562, 87)
Affinity DataIC50:  4.29nM. Assay description: The assays were all performed in a buffer consisting of 20 mM bicine (pH=7.6), 0.5 mM DTT, 0.005% BSG and 0.002% Tween20, prepared on the day of use....
In DepthDetails US Patent
TargetHistone-lysine N-methyltransferase EZH2(Homo sapiens (Human))
Epizyme
US Patent
LigandPNGBDBM172081(US10155002, Compound 87 | US9090562, 87)
Affinity DataIC50:  5.68nM. Assay description: The assays were all performed in a buffer consisting of 20 mM bicine (pH=7.6), 0.5 mM DTT, 0.005% BSG and 0.002% Tween20, prepared on the day of use....
In DepthDetails US Patent
TargetHistone-lysine N-methyltransferase EZH2 [Y641F](Homo sapiens (Human))
Epizyme
US Patent
LigandPNGBDBM172081(US10155002, Compound 87 | US9090562, 87)
Affinity DataIC50:  4.29nMT: 2°C. Assay description: The assays were all performed in a buffer consisting of 20 mM bicine (pH=7.6), 0.5 mM DTT, 0.005% BSG and 0.002% Tween20, prepared on the day of use....
In DepthDetails US Patent