BDBM17256 3-chloro-N-{4-chloro-2-[(4-chlorophenyl)carbamoyl]phenyl}-4-({[2-(dimethylamino)ethyl](methyl)amino}methyl)thiophene-2-carboxamide::thiophene-containing non-amidine inhibitor, 58
SMILES CN(C)CCN(C)Cc1csc(C(=O)Nc2ccc(Cl)cc2C(=O)Nc2ccc(Cl)cc2)c1Cl
InChI Key InChIKey=QDKKSLVXVLBPRN-UHFFFAOYSA-N
Data  3 KI
  Tab Delimited (TSV)   2D SDfile   Computed 3D by Vconf -m prep SDfile
Find this compound or compounds like it in BindingDB:
Activity Spreadsheet -- Enzyme Inhibition Constant Data from BindingDB
Found 3 hits for monomerid = 17256
TargetCoagulation factor X(Homo sapiens (Human))
Berlex
LigandPNGBDBM17256(3-chloro-N-{4-chloro-2-[(4-chlorophenyl)carbamoyl]...)
Affinity DataKi:  0.450nM. Assay description: The enzyme activities were determined kinetically as the initial rate of cleavage of a peptide p-nitroanilide. Km for enzyme and substrate was determ...
In DepthDetails ArticlePubMed
TargetProthrombin(Homo sapiens (Human))
Berlex
LigandPNGBDBM17256(3-chloro-N-{4-chloro-2-[(4-chlorophenyl)carbamoyl]...)
Affinity DataKi:  160nM. Assay description: The enzyme activities were determined kinetically as the initial rate of cleavage of a peptide p-nitroanilide. Km for enzyme and substrate was determ...
In DepthDetails ArticlePubMed
TargetSerine protease 1(Bos taurus (bovine))
Berlex
LigandPNGBDBM17256(3-chloro-N-{4-chloro-2-[(4-chlorophenyl)carbamoyl]...)
Affinity DataKi: >5.00E+3nM. Assay description: The enzyme activities were determined kinetically as the initial rate of cleavage of a peptide p-nitroanilide. Km for enzyme and substrate was determ...
In DepthDetails ArticlePubMed