BDBM173066 US9096579, 168
SMILES Cc1cc(Nc2nccc(n2)-c2cn(C)cn2)cc2cc([nH]c12)C(=O)N1CCc2nocc2C1
InChI Key InChIKey=LONKQAMFBXERKU-UHFFFAOYSA-N
Data  2 IC50
  Tab Delimited (TSV)   2D SDfile   Computed 3D by Vconf -m prep SDfile
Find this compound or compounds like it in BindingDB:
Activity Spreadsheet -- Enzyme Inhibition Constant Data from BindingDB
Found 2 hits for monomerid = 173066
TargetTyrosine-protein kinase SYK(Homo sapiens (Human))
Boehringer Ingelheim International
US Patent
LigandPNGBDBM173066(US9096579, 168)
Affinity DataIC50:  7.5nM. Assay description: Recombinant human Syk (amino acids 342-635) was expressed as a fusion protein with an N-terminal GST tag, affinity-purified and deep-frozen at a conc...
In DepthDetails US Patent
TargetTyrosine-protein kinase SYK(Homo sapiens (Human))
Boehringer Ingelheim International
US Patent
LigandPNGBDBM173066(US9096579, 168)
Affinity DataIC50:  18.7nM. Assay description: Recombinant human Syk (amino acids 342-635) was expressed as a fusion protein with an N-terminal GST tag, affinity-purified and deep-frozen at a conc...
In DepthDetails US Patent