BDBM173740 US9102591, (+)2-chloro-N-[3-cyclopropyl-2-methyl-2-[2-(trifluoromethyl)pyrimidin-5-yl]propyl]benzamide::US9102591, (-)2-chloro-N-[3-cyclopropyl-2-methyl-2-[2-(trifluoromethyl)pyrimidin-5-yl]propyl]benzamide::US9102591, 2-chloro-N-[3-cyclopropyl-2-methyl-2-[2-(trifluoromethyl)pyrimidin-5-yl]propyl]benzamide::US9649308, (-)2-chloro-N-[3-cyclopropyl-2-methyl-2-[2-(trifluoromethyl)pyrimidin-5-yl]propyl]benzamide
SMILES CC(CNC(=O)c1ccccc1Cl)(CC1CC1)c1cnc(nc1)C(F)(F)F
InChI Key InChIKey=WJFDKOHMAALCBK-UHFFFAOYSA-N
Data  6 IC50
  Tab Delimited (TSV)   2D SDfile   Computed 3D by Vconf -m prep SDfile
Find this compound or compounds like it in BindingDB:
Activity Spreadsheet -- Enzyme Inhibition Constant Data from BindingDB
Found 6 hits for monomerid = 173740
TargetP2X purinoceptor 7(Homo sapiens (Human))
H. Lundbeck
US Patent
LigandPNGBDBM173740(US9102591, (+)2-chloro-N-[3-cyclopropyl-2-methyl-2...)
Affinity DataIC50:  21nMpH: 7.4 T: 2°C. Assay description: Fluorescent Imaging Plate Reader (FLIPR) assay: Briefly, 293-human or mouse P2X7 stable cells were incubated in sucrose buffer, pH 7.4 [KCl (5 mM), N...
In DepthDetails US Patent
TargetP2X purinoceptor 7(Homo sapiens (Human))
H. Lundbeck
US Patent
LigandPNGBDBM173740(US9102591, (+)2-chloro-N-[3-cyclopropyl-2-methyl-2...)
Affinity DataIC50:  460nMpH: 7.4 T: 2°C. Assay description: Fluorescent Imaging Plate Reader (FLIPR) assay: Briefly, 293-human or mouse P2X7 stable cells were incubated in sucrose buffer, pH 7.4 [KCl (5 mM), N...
In DepthDetails US Patent
TargetP2X purinoceptor 7(Homo sapiens (Human))
H. Lundbeck
US Patent
LigandPNGBDBM173740(US9102591, (+)2-chloro-N-[3-cyclopropyl-2-methyl-2...)
Affinity DataIC50:  17nM. Assay description: Fluorescent Imaging Plate Reader (FLIPR) assay: Briefly, 293-human or mouse P2X7 stable cells were incubated in sucrose buffer, pH 7.4 [KCl (5 mM), N...
In DepthDetails US Patent
TargetP2X purinoceptor 7(Homo sapiens (Human))
H. Lundbeck
US Patent
LigandPNGBDBM173740(US9102591, (+)2-chloro-N-[3-cyclopropyl-2-methyl-2...)
Affinity DataIC50:  21nM. Assay description: Fluorescent Imaging Plate Reader (FLIPR) assay: Briefly, 293-human or mouse P2X7 stable cells were incubated in sucrose buffer, pH 7.4 [KCl (5 mM), N...
In DepthDetails US Patent
TargetP2X purinoceptor 7(Homo sapiens (Human))
H. Lundbeck
US Patent
LigandPNGBDBM173740(US9102591, (+)2-chloro-N-[3-cyclopropyl-2-methyl-2...)
Affinity DataIC50:  460nM. Assay description: Fluorescent Imaging Plate Reader (FLIPR) assay: Briefly, 293-human or mouse P2X7 stable cells were incubated in sucrose buffer, pH 7.4 [KCl (5 mM), N...
In DepthDetails US Patent
TargetP2X purinoceptor 7(Homo sapiens (Human))
H. Lundbeck
US Patent
LigandPNGBDBM173740(US9102591, (+)2-chloro-N-[3-cyclopropyl-2-methyl-2...)
Affinity DataIC50:  17nMpH: 7.4 T: 2°C. Assay description: Fluorescent Imaging Plate Reader (FLIPR) assay: Briefly, 293-human or mouse P2X7 stable cells were incubated in sucrose buffer, pH 7.4 [KCl (5 mM), N...
In DepthDetails US Patent