BDBM174360 US9102670, 1by
SMILES C[C@H]1CN(C[C@@H](C)O1)c1nc(N2CCOC[C@@H]2C)c2ccc(nc2n1)-c1ccc(CO)cc1
InChI Key InChIKey=BMPMOFIKRWQSBW-OKZBNKHCSA-N
Data  1 IC50
  Tab Delimited (TSV)   2D SDfile   Computed 3D by Vconf -m prep SDfile
Find this compound or compounds like it in BindingDB:
Activity Spreadsheet -- Enzyme Inhibition Constant Data from BindingDB
Found 1 hit for monomerid = 174360
TargetSerine/threonine-protein kinase mTOR(Homo sapiens (Human))
Kudos Pharmaceuticals
US Patent
LigandPNGBDBM174360(US9102670, 1by)
Affinity DataIC50:  4.60nMT: 2°C. Assay description: The assay used AlphaScreen technology (Gray et al., Analytical Biochemistry, 2003, 313: 234-245) to determine the ability of test compounds to inhibi...
In DepthDetails US Patent