BDBM174413 US9102670, 1dt
SMILES C[C@H]1COCCN1c1nc(N2CCOC[C@@H]2C)c2ccc(nc2n1)-c1ccc2CNC(=O)c2c1
InChI Key InChIKey=VTQVVWDFBZSCLC-HOTGVXAUSA-N
Data  1 IC50
  Tab Delimited (TSV)   2D SDfile   Computed 3D by Vconf -m prep SDfile
Find this compound or compounds like it in BindingDB:
Activity Spreadsheet -- Enzyme Inhibition Constant Data from BindingDB
Found 1 hit for monomerid = 174413
TargetSerine/threonine-protein kinase mTOR(Homo sapiens (Human))
Kudos Pharmaceuticals
US Patent
LigandPNGBDBM174413(US9102670, 1dt)
Affinity DataIC50:  2.60nMT: 2°C. Assay description: The assay used AlphaScreen technology (Gray et al., Analytical Biochemistry, 2003, 313: 234-245) to determine the ability of test compounds to inhibi...
In DepthDetails US Patent