BDBM174627 US9102670, 18q
SMILES COc1ccc(cc1CO)-c1ccc2c(nc(nc2n1)N1CCCC1)N1CCOC[C@@H]1C
InChI Key InChIKey=QBLHOGFZBFUVBU-INIZCTEOSA-N
Data  1 IC50
  Tab Delimited (TSV)   2D SDfile   Computed 3D by Vconf -m prep SDfile
Find this compound or compounds like it in BindingDB:
Activity Spreadsheet -- Enzyme Inhibition Constant Data from BindingDB
Found 1 hit for monomerid = 174627
TargetSerine/threonine-protein kinase mTOR(Homo sapiens (Human))
Kudos Pharmaceuticals
US Patent
LigandPNGBDBM174627(US9102670, 18q)
Affinity DataIC50:  110nMT: 2°C. Assay description: The assay used AlphaScreen technology (Gray et al., Analytical Biochemistry, 2003, 313: 234-245) to determine the ability of test compounds to inhibi...
In DepthDetails US Patent