BDBM174719 US9102670, 18di
SMILES C[C@H]1COCCN1c1nc(nc2nc(ccc12)-c1ccc(Cl)cc1)N1CCOCC1
InChI Key InChIKey=ZZBDNGJIQGWWHP-HNNXBMFYSA-N
Data  1 IC50
  Tab Delimited (TSV)   2D SDfile   Computed 3D by Vconf -m prep SDfile
Find this compound or compounds like it in BindingDB:
Activity Spreadsheet -- Enzyme Inhibition Constant Data from BindingDB
Found 1 hit for monomerid = 174719
TargetSerine/threonine-protein kinase mTOR(Homo sapiens (Human))
Kudos Pharmaceuticals
US Patent
LigandPNGBDBM174719(US9102670, 18di)
Affinity DataIC50:  150nMT: 2°C. Assay description: The assay used AlphaScreen technology (Gray et al., Analytical Biochemistry, 2003, 313: 234-245) to determine the ability of test compounds to inhibi...
In DepthDetails US Patent