BDBM174727 US9102670, 19a
SMILES COc1ccc(cc1CO)-c1ccc2c(nc(nc2n1)-c1ccco1)N1CCOC[C@@H]1C
InChI Key InChIKey=WASQHPSQSBFITI-HNNXBMFYSA-N
Data  1 IC50
  Tab Delimited (TSV)   2D SDfile   Computed 3D by Vconf -m prep SDfile
Find this compound or compounds like it in BindingDB:
Activity Spreadsheet -- Enzyme Inhibition Constant Data from BindingDB
Found 1 hit for monomerid = 174727
TargetSerine/threonine-protein kinase mTOR(Homo sapiens (Human))
Kudos Pharmaceuticals
US Patent
LigandPNGBDBM174727(US9102670, 19a)
Affinity DataIC50:  48nMT: 2°C. Assay description: The assay used AlphaScreen technology (Gray et al., Analytical Biochemistry, 2003, 313: 234-245) to determine the ability of test compounds to inhibi...
In DepthDetails US Patent