BDBM174893 US9102669, 85
SMILES Cc1cn(cn1)-c1ccc(nn1)N1CCC(CC1)c1noc2ccc(F)cc12
InChI Key InChIKey=YNJJNKJRNAZYAT-UHFFFAOYSA-N
Data  1 IC50
  Tab Delimited (TSV)   2D SDfile   Computed 3D by Vconf -m prep SDfile
Find this compound or compounds like it in BindingDB:
Activity Spreadsheet -- Enzyme Inhibition Constant Data from BindingDB
Found 1 hit for monomerid = 174893
TargetAcyl-CoA desaturase 1(Rattus norvegicus (Rat))
Janssen Pharmaceutica
US Patent
LigandPNGBDBM174893(US9102669, 85)
Affinity DataIC50:  65nMT: 2°C. Assay description: The SCD1 enzymatic assay was done in a volume of 50 μL using 10 μg of RLM (prepared as described above) in a 96-well polypropylene plate (e...
In DepthDetails US Patent