BDBM175223 US9688680, 10
SMILES C[C@H](NCC1CN(C1)c1ncnn2cc(cc12)-c1cnn(C)c1)c1ccc(C)cc1
InChI Key InChIKey=RKFWDNIJPUTNJY-KRWDZBQOSA-N
Data  3 IC50
  Tab Delimited (TSV)   2D SDfile   Computed 3D by Vconf -m prep SDfile
Find this compound or compounds like it in BindingDB:
Activity Spreadsheet -- Enzyme Inhibition Constant Data from BindingDB
Found 3 hits for monomerid = 175223
TargetMast/stem cell growth factor receptor Kit [D816V](Homo sapiens (Human))
Blueprint Medicines
US Patent
LigandPNGBDBM175223(US9688680, 10)
Affinity DataIC50:  5.5nMpH: 7.5 T: 2°C. Assay description: In each well of a 384-well plate, 0.2 ng/ul final (2 nM) of wild type Kit (Carna Bioscience 08-156) was incubated in a total of 12.5 ul of buffer (10...
Ligand InfoPC cidPC sid
In DepthDetails US Patent
TargetMast/stem cell growth factor receptor Kit [V560G,D816V](Homo sapiens (Human))
Blueprint Medicines
US Patent
LigandPNGBDBM175223(US9688680, 10)
Affinity DataIC50: <10nMT: 2°C. Assay description: 10,000 HMC1.2 cells were incubated in 22 ul culture media (phenol-red free IMDM, no serum) in each well of a 384-well plate and serum starved overnig...
Ligand InfoPC cidPC sid
In DepthDetails US Patent
TargetMast/stem cell growth factor receptor Kit(Homo sapiens (Human))
Blueprint Medicines
US Patent
LigandPNGBDBM175223(US9688680, 10)
Affinity DataIC50:  550nMpH: 7.5 T: 2°C. Assay description: In each well of a 384-well plate, 0.04 ng/ul (0.5 nM) of D816V Kit (Carna Bioscience 08-156) was incubated in a total of 12.5 ul of buffer (100 mM HE...
Ligand InfoPC cidPC sid
In DepthDetails US Patent