BDBM175274 Trans-1,2,3,4,5-Pentafluoro-6-styryl-benzene (14)
SMILES Fc1c(F)c(F)c(\C=C/c2ccccc2)c(F)c1F
InChI Key InChIKey=FGXKQXGCJXOIAL-SREVYHEPSA-N
Data  1 IC50
  Tab Delimited (TSV)   2D SDfile   Computed 3D by Vconf -m prep SDfile
Find this compound or compounds like it in BindingDB:
Activity Spreadsheet -- Enzyme Inhibition Constant Data from BindingDB
Found 1 hit for monomerid = 175274
TargetTyrosinase(Mus musculus (Mouse))
Indian Institute Of Integrative Medicine
LigandPNGBDBM175274(Trans-1,2,3,4,5-Pentafluoro-6-styryl-benzene (14))
Affinity DataIC50: >5.00E+5nMpH: 6.8Assay Description:The reaction mixture contained 50 mM phosphate buffer, pH 6.8, 0.05% L-DOPA and the supernatant (tyrosinase). After incubation in the absence or pres...
Ligand InfoPC cidPC sid
In DepthDetails ArticlePubMed