BDBM176306 US9688696, 21
SMILES Clc1cccc(Cl)c1NC(=O)N1CCN(CC1)c1ccc(cc1)-c1ccnc(n1)N1CCCCC1
InChI Key InChIKey=RIDZBSAGTHRDDX-UHFFFAOYSA-N
Data  1 IC50
  Tab Delimited (TSV)   2D SDfile   Computed 3D by Vconf -m prep SDfile
Find this compound or compounds like it in BindingDB:
Activity Spreadsheet -- Enzyme Inhibition Constant Data from BindingDB
Found 1 hit for monomerid = 176306
TargetDiacylglycerol O-acyltransferase 1(Homo sapiens (Human))
Janssen Pharmaceutica
US Patent
LigandPNGBDBM176306(US9688696, 21)
Affinity DataIC50:  5.75E+3nMpH: 7.4 T: 2°C. Assay description: DGAT activity in membrane preparations was assayed in 50 mM Tris-HCl (pH 7.4), 150 mM MgCl2, 1 mM EDTA and 0.2% BSA, containing 50 μM DAG, 32 &#...
Ligand InfoPC cidPC sid
In DepthDetails US Patent