BDBM176345 US9688696, 61
SMILES Oc1cc(Cl)c(NC(=O)N2CCN(CC2)c2ccc(cc2)-c2ccn(CCc3ccccc3)n2)c(Cl)c1
InChI Key InChIKey=DWTWSVDNMXNGFW-UHFFFAOYSA-N
Data  1 IC50
  Tab Delimited (TSV)   2D SDfile   Computed 3D by Vconf -m prep SDfile
Find this compound or compounds like it in BindingDB:
Activity Spreadsheet -- Enzyme Inhibition Constant Data from BindingDB
Found 1 hit for monomerid = 176345
TargetDiacylglycerol O-acyltransferase 1(Homo sapiens (Human))
Janssen Pharmaceutica
US Patent
LigandPNGBDBM176345(US9688696, 61)
Affinity DataIC50:  151nMpH: 7.4 T: 2°C. Assay description: DGAT activity in membrane preparations was assayed in 50 mM Tris-HCl (pH 7.4), 150 mM MgCl2, 1 mM EDTA and 0.2% BSA, containing 50 μM DAG, 32 &#...
Ligand InfoPC cidPC sid
In DepthDetails US Patent