BDBM176624 US9115121, 15
SMILES COc1nc(NCCc2ccc(F)cc2)nc(n1)-c1ccc(c(OC)c1)C(C)(C)O
InChI Key InChIKey=GOCKNBZHVRMBGN-UHFFFAOYSA-N
Data  1 IC50
  Tab Delimited (TSV)   2D SDfile   Computed 3D by Vconf -m prep SDfile
Find this compound or compounds like it in BindingDB:
Activity Spreadsheet -- Enzyme Inhibition Constant Data from BindingDB
Found 1 hit for monomerid = 176624
TargetCannabinoid receptor 2(Homo sapiens (Human))
Sanofi
US Patent
LigandPNGBDBM176624(US9115121, 15)
Affinity DataIC50:  17nM. Assay description: Affinity binding tests were performed according to the experimental conditions described by M. Rinaldi-Carmona in J. Pharmacol. Exp. Therap. 1998, 28...
In DepthDetails US Patent