BDBM176757 US9675612, 7 6-[(2-Cyclohexyl[1,3]thiazolo[5,4-d]pyrimidin-7-yl)amino]-5-methoxy-1,3-benzothiazol-2(3H)-one
SMILES COc1cc2[nH]c(=O)sc2cc1Nc1ncnc2sc(nc12)C1CCCCC1
InChI Key InChIKey=YEDGAQYUGFJXFR-UHFFFAOYSA-N
Data  1 IC50
  Tab Delimited (TSV)   2D SDfile   Computed 3D by Vconf -m prep SDfile
Find this compound or compounds like it in BindingDB:
Activity Spreadsheet -- Enzyme Inhibition Constant Data from BindingDB
Found 1 hit for monomerid = 176757
TargetIsoform 2 of MAP kinase-interacting serine/threonine-protein kinase 1 (MNK1a) 344D](Homo sapiens (Human))
Bayer Pharma Aktiengesellschaft
US Patent
LigandPNGBDBM176757(US9675612, 7 6-[(2-Cyclohexyl[1,3]thiazolo[5,4-d]p...)
Affinity DataIC50:  354nMpH: 7.5Assay Description:For the assay 50 nL of a 100 fold concentrated solution of the test compound in DMSO was pipetted into a black low volume 384 well microtiter plate (...
Ligand InfoPC cidPC sid
In DepthDetails US Patent