BDBM177043 US9120749, 409
SMILES Oc1c(Cl)cc(cc1Cl)-c1ccc2ncc(C(=O)C3CC3)c(Nc3ccc(nc3)N3CCNCC3)c2c1
InChI Key InChIKey=MOOWYWLOHNKDIF-UHFFFAOYSA-N
Data  1 IC50
  Tab Delimited (TSV)   2D SDfile   Computed 3D by Vconf -m prep SDfile
Find this compound or compounds like it in BindingDB:
Activity Spreadsheet -- Enzyme Inhibition Constant Data from BindingDB
Found 1 hit for monomerid = 177043
TargetMaternal embryonic leucine zipper kinase(Homo sapiens (Human))
Oncotherapy Science
US Patent
LigandPNGBDBM177043(US9120749, 409)
Affinity DataIC50:  1.70nMpH: 7.4 T: 2°C. Assay description: MELK activity was determined in the presence or absence of compounds using fluorescein isothiocyanate-labeled (FITC-labeled) histone H3 peptide as a ...
In DepthDetails US Patent