BDBM177089 US9120749, 455
SMILES CN(C)CC(=O)N1CC2CC1CN2c1c(cnc2ccc(cc12)-c1cc(F)c(O)c(Cl)c1)C(=O)C1CC1
InChI Key InChIKey=UHOOVRKLUGEDKS-UHFFFAOYSA-N
Data  1 IC50
  Tab Delimited (TSV)   2D SDfile   Computed 3D by Vconf -m prep SDfile
Find this compound or compounds like it in BindingDB:
Activity Spreadsheet -- Enzyme Inhibition Constant Data from BindingDB
Found 1 hit for monomerid = 177089
TargetMaternal embryonic leucine zipper kinase(Homo sapiens (Human))
Oncotherapy Science
US Patent
LigandPNGBDBM177089(US9120749, 455)
Affinity DataIC50:  69nMpH: 7.4 T: 2°C. Assay description: MELK activity was determined in the presence or absence of compounds using fluorescein isothiocyanate-labeled (FITC-labeled) histone H3 peptide as a ...
In DepthDetails US Patent