BDBM177109 US9120749, 475
SMILES COc1cc(cc(Cl)c1O)-c1ccc2ncc(C(=O)C3CC3)c(-c3cnc(nc3)N3CCN(C)CC3)c2c1
InChI Key InChIKey=YHKBEHASGVCGMT-UHFFFAOYSA-N
Data  1 IC50
  Tab Delimited (TSV)   2D SDfile   Computed 3D by Vconf -m prep SDfile
Find this compound or compounds like it in BindingDB:
Activity Spreadsheet -- Enzyme Inhibition Constant Data from BindingDB
Found 1 hit for monomerid = 177109
TargetMaternal embryonic leucine zipper kinase(Homo sapiens (Human))
Oncotherapy Science
US Patent
LigandPNGBDBM177109(US9120749, 475)
Affinity DataIC50:  72nMpH: 7.4 T: 2°C. Assay description: MELK activity was determined in the presence or absence of compounds using fluorescein isothiocyanate-labeled (FITC-labeled) histone H3 peptide as a ...
In DepthDetails US Patent