BDBM177214 US9120749, 580
SMILES Oc1c(Cl)cc(cc1Cl)-c1ccc2ncc(C(=O)C3CC3)c(N[C@@H]3C[C@@H]4CC[C@H](C3)N4)c2c1
InChI Key InChIKey=KSBNRSWJRGRELY-PIIMJCKOSA-N
Data  1 IC50
  Tab Delimited (TSV)   2D SDfile   Computed 3D by Vconf -m prep SDfile
Find this compound or compounds like it in BindingDB:
Activity Spreadsheet -- Enzyme Inhibition Constant Data from BindingDB
Found 1 hit for monomerid = 177214
TargetMaternal embryonic leucine zipper kinase(Homo sapiens (Human))
Oncotherapy Science
US Patent
LigandPNGBDBM177214(US9120749, 580)
Affinity DataIC50:  4.5nMpH: 7.4 T: 2°C. Assay description: MELK activity was determined in the presence or absence of compounds using fluorescein isothiocyanate-labeled (FITC-labeled) histone H3 peptide as a ...
In DepthDetails US Patent