BDBM177447 US9120749, 813
SMILES CN1CCC(C1)n1cc(Nc2c(cnc3ccc(cc23)-c2cc(F)c(O)c(Cl)c2)C(C)=O)cn1
InChI Key InChIKey=FHFPAOCGADYXMP-UHFFFAOYSA-N
Data  1 IC50
  Tab Delimited (TSV)   2D SDfile   Computed 3D by Vconf -m prep SDfile
Find this compound or compounds like it in BindingDB:
Activity Spreadsheet -- Enzyme Inhibition Constant Data from BindingDB
Found 1 hit for monomerid = 177447
TargetMaternal embryonic leucine zipper kinase(Homo sapiens (Human))
Oncotherapy Science
US Patent
LigandPNGBDBM177447(US9120749, 813)
Affinity DataIC50:  2.10nMpH: 7.4 T: 2°C. Assay description: MELK activity was determined in the presence or absence of compounds using fluorescein isothiocyanate-labeled (FITC-labeled) histone H3 peptide as a ...
In DepthDetails US Patent