BDBM177763 US9120785, Example 10::US9120785, Example 11
SMILES Cc1cc(Nc2cc(C)c(F)cn2)nc(c1)-c1cnc(s1)C(C)(O)[C@H]1CC[C@@H](CC1)C(O)=O
InChI Key InChIKey=WTOYVMRZKUNBTQ-PGUYCLEYSA-N
Data  2 IC50
  Tab Delimited (TSV)   2D SDfile   Computed 3D by Vconf -m prep SDfile
Find this compound or compounds like it in BindingDB:
Activity Spreadsheet -- Enzyme Inhibition Constant Data from BindingDB
Found 2 hits for monomerid = 177763
TargetTyrosine-protein kinase SYK(Homo sapiens (Human))
Merck Sharp & Dohme
US Patent
LigandPNGBDBM177763(US9120785, Example 10 | US9120785, Example 11)
Affinity DataIC50:  0.5nMpH: 7.5 T: 2°C. Assay description: Homogeneous Time-Resolved Fluorescence (HTRF) assay for the recombinant human Syk enzyme: A recombinant GST-hSyk fusion protein was used to measure p...
In DepthDetails US Patent
TargetTyrosine-protein kinase SYK(Homo sapiens (Human))
Merck Sharp & Dohme
US Patent
LigandPNGBDBM177763(US9120785, Example 10 | US9120785, Example 11)
Affinity DataIC50:  0.100nMpH: 7.5 T: 2°C. Assay description: Homogeneous Time-Resolved Fluorescence (HTRF) assay for the recombinant human Syk enzyme: A recombinant GST-hSyk fusion protein was used to measure p...
In DepthDetails US Patent