BDBM177977 US9120798, 17
SMILES COC(=O)c1nnc(Nc2ccccc2N2CC3(CCN(CC(C)(C)C)CC3)c3c2c(O)ccc3Cl)s1
InChI Key InChIKey=HBCBRIKFLXFWHF-UHFFFAOYSA-N
Data  1 IC50
  Tab Delimited (TSV)   2D SDfile   Computed 3D by Vconf -m prep SDfile
Find this compound or compounds like it in BindingDB:
Activity Spreadsheet -- Enzyme Inhibition Constant Data from BindingDB
Found 1 hit for monomerid = 177977
TargetP2Y purinoceptor 1(Homo sapiens (Human))
Bristol-Myers Squibb
US Patent
LigandPNGBDBM177977(US9120798, 17)
Affinity DataIC50:  48nMpH: 7.4 T: 2°C. Assay description: SPA membrane binding assay was used to identify inhibitors of [33P] 2MeS-ADP binding to cloned human P2Yi receptors (The P2Yi receptor membranes were...
Ligand InfoPC cidPC sid
In DepthDetails US Patent