BDBM177995 US9120798, 42
SMILES CC(C)(C)CN1CCC2(CN(c3c2c(Cl)ccc3O)c2ccccc2Nc2ccc(cn2)C(F)(F)F)CC1
InChI Key InChIKey=LZORFYCGZQRIMW-UHFFFAOYSA-N
Data  1 IC50
  Tab Delimited (TSV)   2D SDfile   Computed 3D by Vconf -m prep SDfile
Find this compound or compounds like it in BindingDB:
Activity Spreadsheet -- Enzyme Inhibition Constant Data from BindingDB
Found 1 hit for monomerid = 177995
TargetP2Y purinoceptor 1(Homo sapiens (Human))
Bristol-Myers Squibb
US Patent
LigandPNGBDBM177995(US9120798, 42)
Affinity DataIC50:  22nMpH: 7.4 T: 2°C. Assay description: SPA membrane binding assay was used to identify inhibitors of [33P] 2MeS-ADP binding to cloned human P2Yi receptors (The P2Yi receptor membranes were...
In DepthDetails US Patent