BDBM178065 3-(4-((6,7-Dimethoxyquinolin-4-yl)oxy)phenyl)-1-(3-methoxyphenyl)pyridin-2(1H)-one (15)
SMILES COc1cccc(c1)-n1cccc(-c2ccc(Oc3ccnc4cc(OC)c(OC)cc34)cc2)c1=O
InChI Key InChIKey=OFEFBCKWVLRMER-UHFFFAOYSA-N
Data  1 IC50
  Tab Delimited (TSV)   2D SDfile   Computed 3D by Vconf -m prep SDfile
Find this compound or compounds like it in BindingDB:
Activity Spreadsheet -- Enzyme Inhibition Constant Data from BindingDB
Found 1 hit for monomerid = 178065
TargetVascular endothelial growth factor receptor 2(Homo sapiens (Human))
East China University Of Science & Technology
LigandPNGBDBM178065(3-(4-((6,7-Dimethoxyquinolin-4-yl)oxy)phenyl)-1-(3...)
Affinity DataIC50:  4.80nMpH: 7.4Assay Description:The substrate of poly (Glu, Tyr) 4:1 (20 lg/mL) (Sigma, St. Louis, MO, USA) was precoated in 96-well ELISA plates, and the kinase was incubated with ...
In DepthDetails ArticlePubMed