BDBM178074 1-(3-Chlorophenyl)-3-(4-((6,7-dimethoxyquinolin-4-yl)amino)phenyl)pyridin-2(1H)-one (35c)
SMILES COc1cc2nccc(Nc3ccc(cc3)-c3cccn(-c4cccc(Cl)c4)c3=O)c2cc1OC
InChI Key InChIKey=UPZWCXODFAOTRK-UHFFFAOYSA-N
Data  1 IC50
  Tab Delimited (TSV)   2D SDfile   Computed 3D by Vconf -m prep SDfile
Find this compound or compounds like it in BindingDB:
Activity Spreadsheet -- Enzyme Inhibition Constant Data from BindingDB
Found 1 hit for monomerid = 178074
TargetVascular endothelial growth factor receptor 2(Homo sapiens (Human))
East China University Of Science & Technology
LigandPNGBDBM178074(1-(3-Chlorophenyl)-3-(4-((6,7-dimethoxyquinolin-4-...)
Affinity DataIC50:  23.6nMpH: 7.4Assay Description:The substrate of poly (Glu, Tyr) 4:1 (20 lg/mL) (Sigma, St. Louis, MO, USA) was precoated in 96-well ELISA plates, and the kinase was incubated with ...
In DepthDetails ArticlePubMed