BDBM178075 3-(3-Chloro-4-((6,7-dimethoxyquinolin-4-yl)oxy)phenyl)-1-(3-chlorophenyl)pyridin-2(1H)-one (35d)
SMILES COc1cc2nccc(Oc3ccc(cc3Cl)-c3cccn(-c4cccc(Cl)c4)c3=O)c2cc1OC
InChI Key InChIKey=MZBUAWGSCYQKRH-UHFFFAOYSA-N
Data  1 IC50
  Tab Delimited (TSV)   2D SDfile   Computed 3D by Vconf -m prep SDfile
Find this compound or compounds like it in BindingDB:
Activity Spreadsheet -- Enzyme Inhibition Constant Data from BindingDB
Found 1 hit for monomerid = 178075
TargetVascular endothelial growth factor receptor 2(Homo sapiens (Human))
East China University Of Science & Technology
LigandPNGBDBM178075(3-(3-Chloro-4-((6,7-dimethoxyquinolin-4-yl)oxy)phe...)
Affinity DataIC50:  25nMpH: 7.4Assay Description:The substrate of poly (Glu, Tyr) 4:1 (20 lg/mL) (Sigma, St. Louis, MO, USA) was precoated in 96-well ELISA plates, and the kinase was incubated with ...
In DepthDetails ArticlePubMed