BDBM178626 US9125913, 189
SMILES COCCN1CCC(CC1)Nc1ccc(cc1[N+]([O-])=O)S(=O)(=O)NC(=O)c1ccc(cc1Oc1ccc2[nH]ccc2c1)N1CCN(CC2=C(CC(C)(C)CC2)c2ccc(Cl)cc2)CC1
InChI Key InChIKey=BZOMSQXXULNGHO-UHFFFAOYSA-N
Data  2 KI
  Tab Delimited (TSV)   2D SDfile   Computed 3D by Vconf -m prep SDfile
Find this compound or compounds like it in BindingDB:
Activity Spreadsheet -- Enzyme Inhibition Constant Data from BindingDB
Found 2 hits for monomerid = 178626
TargetApoptosis regulator Bcl-2(Mus musculus (Mouse))
Abbvie
US Patent
LigandPNGBDBM178626(US9125913, 189)
Affinity DataKi:  0.144nM. Assay description: The inhibition constant (Ki) is the dissociation constant of an enzyme-inhibitor complex or a protein/small molecule complex, wherein the small molec...
In DepthDetails US Patent
TargetBcl-2-like protein 1(Mus musculus (Mouse))
Abbvie
US Patent
LigandPNGBDBM178626(US9125913, 189)
Affinity DataKi:  51.7nM. Assay description: The inhibition constant (Ki) is the dissociation constant of an enzyme-inhibitor complex or a protein/small molecule complex, wherein the small molec...
In DepthDetails US Patent