BDBM178833 US9125913, 405
SMILES CC1(C)CCC(CN2CCN(CC2)c2ccc(C(=O)NS(=O)(=O)c3cnc(OCC4(F)CCOCC4)c(Cl)c3)c(Oc3cccc4[nH]ccc34)c2)=C(C1)c1ccc(Cl)cc1
InChI Key InChIKey=JZVOHBDETKRCAT-UHFFFAOYSA-N
Data  2 KI
  Tab Delimited (TSV)   2D SDfile   Computed 3D by Vconf -m prep SDfile
Find this compound or compounds like it in BindingDB:
Activity Spreadsheet -- Enzyme Inhibition Constant Data from BindingDB
Found 2 hits for monomerid = 178833
TargetApoptosis regulator Bcl-2(Mus musculus (Mouse))
Abbvie
US Patent
LigandPNGBDBM178833(US9125913, 405)
Affinity DataKi:  0.0400nM. Assay description: The inhibition constant (Ki) is the dissociation constant of an enzyme-inhibitor complex or a protein/small molecule complex, wherein the small molec...
In DepthDetails US Patent
TargetBcl-2-like protein 1(Mus musculus (Mouse))
Abbvie
US Patent
LigandPNGBDBM178833(US9125913, 405)
Affinity DataKi:  55.3nM. Assay description: The inhibition constant (Ki) is the dissociation constant of an enzyme-inhibitor complex or a protein/small molecule complex, wherein the small molec...
In DepthDetails US Patent