BDBM178962 US9126931, 168
SMILES CC1(C)c2[nH]c3cc(ccc3c2C(=O)c2ccc(CNCC(F)(F)F)cc12)C#N
InChI Key InChIKey=AWLHSWDCRPQVBP-UHFFFAOYSA-N
Data  1 IC50
  Tab Delimited (TSV)   2D SDfile   Computed 3D by Vconf -m prep SDfile
Find this compound or compounds like it in BindingDB:
Activity Spreadsheet -- Enzyme Inhibition Constant Data from BindingDB
Found 1 hit for monomerid = 178962
TargetALK tyrosine kinase receptor(Homo sapiens (Human))
Chugai Seiyaku Kabushiki Kaisha
US Patent
LigandPNGBDBM178962(US9126931, 168)
Affinity DataIC50:  11.9nM. Assay description: ALK-inhibiting activity was measured by following an activity of inhibiting phosphorylation by biotinylated peptide (EGPWLEEEEEAYGWMDF). For the dete...
In DepthDetails US Patent