BDBM179026 US9126931, 543
SMILES CC(C)(C)N1CCN(CC1)c1cc2c(cc1Br)C(=O)c1c([nH]c3cc(ccc13)C#N)C21CCOCC1
InChI Key InChIKey=APVIDLUCFAXGHM-UHFFFAOYSA-N
Data  1 IC50
  Tab Delimited (TSV)   2D SDfile   Computed 3D by Vconf -m prep SDfile
Find this compound or compounds like it in BindingDB:
Activity Spreadsheet -- Enzyme Inhibition Constant Data from BindingDB
Found 1 hit for monomerid = 179026
TargetALK tyrosine kinase receptor(Homo sapiens (Human))
Chugai Seiyaku Kabushiki Kaisha
US Patent
LigandPNGBDBM179026(US9126931, 543)
Affinity DataIC50:  0.320nM. Assay description: ALK-inhibiting activity was measured by following an activity of inhibiting phosphorylation by biotinylated peptide (EGPWLEEEEEAYGWMDF). For the dete...
In DepthDetails US Patent