BDBM179244 US9126941, RD83
SMILES Cc1ccnc(c1)N1C(=S)N(C(=O)C1(C)C)c1ccc([N+]#[C-])c(c1)C(F)(F)F
InChI Key InChIKey=PSQULWJIMXPACL-UHFFFAOYSA-N
Data  1 IC50
  Tab Delimited (TSV)   2D SDfile   Computed 3D by Vconf -m prep SDfile
Find this compound or compounds like it in BindingDB:
Activity Spreadsheet -- Enzyme Inhibition Constant Data from BindingDB
Found 1 hit for monomerid = 179244
TargetAndrogen receptor(Homo sapiens (Human))
The Regents Of The University Of California
US Patent
LigandPNGBDBM179244(US9126941, RD83)
Affinity DataIC50:  457nM. Assay description: The compounds were subjected to tests using an artificial AR response reporter system in a hormone refractory prostate cancer cell line. In this syst...
In DepthDetails US Patent