BDBM179330 US9126952, 33
SMILES C(C1CCCN(C1)c1ncnc2cc(ccc12)N1CCOCC1)c1cccs1
InChI Key InChIKey=QXFFCENPWAUOCR-UHFFFAOYSA-N
Data  1 IC50
  Tab Delimited (TSV)   2D SDfile   Computed 3D by Vconf -m prep SDfile
Find this compound or compounds like it in BindingDB:
Activity Spreadsheet -- Enzyme Inhibition Constant Data from BindingDB
Found 1 hit for monomerid = 179330
TargetDNA-dependent protein kinase catalytic subunit(Homo sapiens (Human))
Merck Patent
US Patent
LigandPNGBDBM179330(US9126952, 33)
Affinity DataIC50: <100nMpH: 7.4 T: 2°C. Assay description: The kinase assay was carried out in streptavidin-coated 348-well microtitre FlashPlates®. To this end, 1.5 μg of the DNA-PK/protein complex and ...
In DepthDetails US Patent