BDBM179752 US9127027, 1
SMILES CCCCCCC(=O)[Ni](CCC)CCCC\C=C/CCCCCCC(=O)OCCOCCOCCO
InChI Key InChIKey=JVJCVOUUQWZWMD-WTUPQPTJSA-N
Data  1 IC50
  Tab Delimited (TSV)   2D SDfile   Computed 3D by Vconf -m prep SDfile
Find this compound or compounds like it in BindingDB:
Activity Spreadsheet -- Enzyme Inhibition Constant Data from BindingDB
Found 1 hit for monomerid = 179752
TargetBifunctional epoxide hydrolase 2(Homo sapiens (Human))
The Medical College Of Wisconsin
US Patent
LigandPNGBDBM179752(US9127027, 1)
Affinity DataIC50: >500nM. Assay description: Compounds were tested for their ability to inhibit recombinant soluble epoxide hydrolase (sEH) protein. The assay utilizes (3-Phhenyl-oxiranyl)-aceti...
Ligand InfoPC cidPC sid
In DepthDetails US Patent