BDBM17986 1,4-benzoxazin-3-one, 23::6-(2,4-diamino-6-ethylpyrimidin-5-yl)-2,2-diethyl-4-(3-methoxypropyl)-3,4-dihydro-2H-1,4-benzoxazin-3-one
SMILES CCc1nc(N)nc(N)c1-c1ccc2OC(CC)(CC)C(=O)N(CCCOC)c2c1
InChI Key InChIKey=QENBZBQERGRPHC-UHFFFAOYSA-N
Data  1 IC50
  Tab Delimited (TSV)   2D SDfile   Computed 3D by Vconf -m prep SDfile
Find this compound or compounds like it in BindingDB:
Activity Spreadsheet -- Enzyme Inhibition Constant Data from BindingDB
Found 1 hit for monomerid = 17986
TargetRenin(Homo sapiens (Human))
Pfizer
LigandPNGBDBM17986(1,4-benzoxazin-3-one, 23 | 6-(2,4-diamino-6-ethylp...)
Affinity DataIC50:  245nMpH: 7.4 T: 2°C. Assay description: The renin assay utilized a tandem Green Flourescent Protein (tGFP) substrate that was hydrolyzed by human rennin. The tGFP substrate contained a nine...
In DepthDetails ArticlePubMed