BDBM179991 US9676712, 4C
SMILES CC(CCCc1ccccc1)[C@@H](O)\C=C\[C@H]1CCC(=O)N1CCCc1ccc(s1)C(O)=O
InChI Key InChIKey=UFEKCCMQUIWXBK-UXBVXSMZSA-N
Data  2 EC50
  Tab Delimited (TSV)   2D SDfile   Computed 3D by Vconf -m prep SDfile
Find this compound or compounds like it in BindingDB:
Activity Spreadsheet -- Enzyme Inhibition Constant Data from BindingDB
Found 2 hits for monomerid = 179991
TargetProstaglandin E2 receptor EP2 subtype(Homo sapiens (Human))
Cayman Chemical
US Patent
LigandPNGBDBM179991(US9676712, 4C)
Affinity DataEC50:  2.28E+3nM. Assay description: 1. Seed cells on an EP2 or EP4 STEP plate at a density of 40,000-80,000 cells/well in 200 μl of reduced serum medium containing 0.5% FBS. Place ...
Ligand InfoPC cidPC sid
In DepthDetails US Patent
TargetProstaglandin E2 receptor EP4 subtype(Homo sapiens (Human))
Cayman Chemical
US Patent
LigandPNGBDBM179991(US9676712, 4C)
Affinity DataEC50:  0.00300nM. Assay description: 1. Seed cells on an EP2 or EP4 STEP plate at a density of 40,000-80,000 cells/well in 200 μl of reduced serum medium containing 0.5% FBS. Place ...
Ligand InfoPC cidPC sid
In DepthDetails US Patent