BDBM180643 US8772323, 141
SMILES CCC1CC(=NNC1=O)c1ccc2nc(oc2c1)-c1cccs1
InChI Key InChIKey=LWRSLMALNXUIBC-UHFFFAOYSA-N
Data  1 EC50
  Tab Delimited (TSV)   2D SDfile   Computed 3D by Vconf -m prep SDfile
Find this compound or compounds like it in BindingDB:
Activity Spreadsheet -- Enzyme Inhibition Constant Data from BindingDB
Found 1 hit for monomerid = 180643
TargetGlucose-dependent insulinotropic receptor(Homo sapiens (Human))
Boehringer Ingelheim International
US Patent
LigandPNGBDBM180643(US8772323, 141)
Affinity DataEC50:  7.33E+3nMpH: 7.4 T: 2°C. Assay description: MIN6 cells [Miyazaki J et al. Endocrinology. 1990 July; 127(1):126-32] were stably transfected with an expression vector for human GPR119 cDNA (Acc. ...
In DepthDetails US Patent