BDBM180855 US9133171, 60
SMILES COc1cc(F)ccc1-c1nc(Nc2cc(CS(C)(=O)=NC#N)cc(c2)S(F)(F)(F)(F)F)ncc1F
InChI Key InChIKey=BJBUTEFLQLIASF-UHFFFAOYSA-N
Data  3 IC50
  Tab Delimited (TSV)   2D SDfile   Computed 3D by Vconf -m prep SDfile
Find this compound or compounds like it in BindingDB:
Activity Spreadsheet -- Enzyme Inhibition Constant Data from BindingDB
Found 3 hits for monomerid = 180855
TargetCyclin-dependent kinase 9(Homo sapiens (Human))
Bayer Intellectual Property
US Patent
LigandPNGBDBM180855(US9133171, 60)
Affinity DataIC50:  6nMpH: 8.0 T: 2°C. Assay description: Recombinant full-length His-tagged human CDK9 and CycT1, expressed in insect cells and purified by Ni-NTA affinity chromatography, were purchased fro...
In DepthDetails US Patent
TargetCyclin-dependent kinase 9(Homo sapiens (Human))
Bayer Intellectual Property
US Patent
LigandPNGBDBM180855(US9133171, 60)
Affinity DataIC50:  12nMpH: 8.0 T: 2°C. Assay description: Recombinant full-length His-tagged human CDK9 and CycT1, expressed in insect cells and purified by Ni-NTA affinity chromatography, were purchase from...
In DepthDetails US Patent
TargetCyclin-dependent kinase 2(Homo sapiens (Human))
Bayer Intellectual Property
US Patent
LigandPNGBDBM180855(US9133171, 60)
Affinity DataIC50:  320nMpH: 8.0 T: 2°C. Assay description: Recombinant fusion proteins of GST and human CDK2 and of GST and human CycE, expressed in insect cells (Sf9) and purified by Glutathion-Sepharose aff...
In DepthDetails US Patent