BDBM18126 3-amino-5-({[(2R,3S,4R,5R)-5-(6-amino-9H-purin-9-yl)-3,4-dihydroxyoxolan-2-yl]methoxy}(hydroxy)phosphoryl)-4-oxopentanoic acid::beta-ketophosphonate, 15
SMILES NC(CC(O)=O)C(=O)CP(O)(=O)OC[C@H]1O[C@H]([C@H](O)[C@@H]1O)n1cnc2c(N)ncnc12
InChI Key InChIKey=KMYVNAQFBILXBR-KWWUWDJMSA-N
Data  1 KI
  Tab Delimited (TSV)   2D SDfile   Computed 3D by Vconf -m prep SDfile
Find this compound or compounds like it in BindingDB:
Activity Spreadsheet -- Enzyme Inhibition Constant Data from BindingDB
Found 1 hit for monomerid = 18126
TargetAspartate--tRNA ligase(Escherichia coli)
Crefsip
LigandPNGBDBM18126(3-amino-5-({[(2R,3S,4R,5R)-5-(6-amino-9H-purin-9-y...)
Affinity DataKi:  123nM ΔG°:  -9.80kcal/molepH: 7.5 T: 2°C. Assay description: The Km and Kappm for the amino acid substrate were first calculated from Lineweaver-Burk plots. The Ki values were calculated from the Kappm vs [I] p...
In DepthDetails ArticlePubMed