BDBM181895 US9145380, 190::US9145380, 98
SMILES Cc1ccc(NS(=O)(=O)\C=C\c2ccc(Br)cc2)c(c1)S(N)(=O)=O
InChI Key InChIKey=HWNKAJDTOOPJAM-CMDGGOBGSA-N
Data  2 IC50
  Tab Delimited (TSV)   2D SDfile   Computed 3D by Vconf -m prep SDfile
Find this compound or compounds like it in BindingDB:
Activity Spreadsheet -- Enzyme Inhibition Constant Data from BindingDB
Found 2 hits for monomerid = 181895
TargetProstaglandin E synthase 2(Homo sapiens (Human))
Astrazeneca
US Patent
LigandPNGBDBM181895(US9145380, 190 | US9145380, 98)
Affinity DataIC50:  680nMpH: 6.8Assay Description:A solution of test compound was added to a diluted microsome preparation containing human mPGES-1 and pre-incubated for 15 minutes in potassium phosp...
In DepthDetails US Patent
TargetProstaglandin E synthase 2(Homo sapiens (Human))
Astrazeneca
US Patent
LigandPNGBDBM181895(US9145380, 190 | US9145380, 98)
Affinity DataIC50:  680nMpH: 6.8Assay Description:A solution of test compound was added to a diluted microsome preparation containing human mPGES-1 and pre-incubated for 15 minutes in potassium phosp...
In DepthDetails US Patent