BDBM182120 US9145391, 4-17
SMILES Cc1cc(Nc2cc(ccn2)C(F)(F)F)nc(c1)-c1ccc(nc1)N1CCCC(C1)NC(=O)c1ccc2cc[nH]c2c1
InChI Key
Data  1 IC50
  Tab Delimited (TSV)   2D SDfile   Computed 3D by Vconf -m prep SDfile
Find this compound or compounds like it in BindingDB:
Activity Spreadsheet -- Enzyme Inhibition Constant Data from BindingDB
Found 1 hit for monomerid = 182120
TargetTyrosine-protein kinase SYK(Homo sapiens (Human))
Merck Sharp & Dohme
US Patent
LigandPNGBDBM182120(US9145391, 4-17)
Affinity DataIC50:  32nMpH: 7.5 T: 2°C. Assay description: A recombinant GST-hSyk fusion protein was used to measure potency of compounds to inhibit human Syk activity. The recombinant human GST-Syk (Carna Bi...
In DepthDetails US Patent