BDBM18228 4-[2-({2,4-diamino-5-methylpyrido[2,3-d]pyrimidin-6-yl}methyl)-4-methoxyphenoxy]butanoic acid::Piritrexim analogue, 9
SMILES COc1ccc(OCCCC(O)=O)c(Cc2cnc3nc(N)nc(N)c3c2C)c1
InChI Key InChIKey=PBWQOXPBOBZOLO-UHFFFAOYSA-N
Data  4 IC50
  Tab Delimited (TSV)   2D SDfile   Computed 3D by Vconf -m prep SDfile
Find this compound or compounds like it in BindingDB:
Activity Spreadsheet -- Enzyme Inhibition Constant Data from BindingDB
Found 4 hits for monomerid = 18228
TargetDihydrofolate reductase(Pneumocystis carinii)
Harvard Medical School
LigandPNGBDBM18228(4-[2-({2,4-diamino-5-methylpyrido[2,3-d]pyrimidin-...)
Affinity DataIC50:  0.170nMpH: 7.4 T: 2°C. Assay description: Dihydrofolate reductase was assayed with no inhibitor and with a series of concentrations of inhibitors to allow for a range of inhibition from 10 to...
In DepthDetails ArticlePubMed
TargetDihydrofolate reductase(Rattus norvegicus (rat))
Harvard Medical School
LigandPNGBDBM18228(4-[2-({2,4-diamino-5-methylpyrido[2,3-d]pyrimidin-...)
Affinity DataIC50:  9.10nM. Assay description: Dihydrofolate reductase was assayed with no inhibitor and with a series of concentrations of inhibitors to allow for a range of inhibition from 10 to...
In DepthDetails ArticlePubMed
TargetDihydrofolate reductase(Mycobacterium avium)
Harvard Medical School
LigandPNGBDBM18228(4-[2-({2,4-diamino-5-methylpyrido[2,3-d]pyrimidin-...)
Affinity DataIC50:  0.320nM. Assay description: Dihydrofolate reductase was assayed with no inhibitor and with a series of concentrations of inhibitors to allow for a range of inhibition from 10 to...
In DepthDetails ArticlePubMed
TargetBifunctional dihydrofolate reductase-thymidylate synthase(Toxoplasma gondii)
Harvard Medical School
LigandPNGBDBM18228(4-[2-({2,4-diamino-5-methylpyrido[2,3-d]pyrimidin-...)
Affinity DataIC50:  2.30nM. Assay description: Dihydrofolate reductase was assayed with no inhibitor and with a series of concentrations of inhibitors to allow for a range of inhibition from 10 to...
In DepthDetails ArticlePubMed