BDBM18236 6-{2-[(2,4-diaminopteridin-6-yl)methyl]-2-azatricyclo[9.4.0.0^{3,8}]pentadeca-1(11),3,5,7,9,12,14-heptaen-6-yl}hex-5-ynoic acid::Pteridine analogue, 21
SMILES Nc1nc(N)c2nc(CN3c4ccccc4C=Cc4cc(ccc34)C#CCCCC(O)=O)cnc2n1
InChI Key InChIKey=WYZXOMCIHIBOBA-UHFFFAOYSA-N
Data  4 IC50
  Tab Delimited (TSV)   2D SDfile   Computed 3D by Vconf -m prep SDfile
Find this compound or compounds like it in BindingDB:
Activity Spreadsheet -- Enzyme Inhibition Constant Data from BindingDB
Found 4 hits for monomerid = 18236
TargetDihydrofolate reductase(Pneumocystis carinii)
Harvard Medical School
LigandPNGBDBM18236(6-{2-[(2,4-diaminopteridin-6-yl)methyl]-2-azatricy...)
Affinity DataIC50:  12nMpH: 7.4 T: 2°C. Assay description: Dihydrofolate reductase was assayed with no inhibitor and with a series of concentrations of inhibitors to allow for a range of inhibition from 10 to...
In DepthDetails ArticlePubMed
TargetDihydrofolate reductase(Rattus norvegicus (rat))
Harvard Medical School
LigandPNGBDBM18236(6-{2-[(2,4-diaminopteridin-6-yl)methyl]-2-azatricy...)
Affinity DataIC50:  1.30E+3nM. Assay description: Dihydrofolate reductase was assayed with no inhibitor and with a series of concentrations of inhibitors to allow for a range of inhibition from 10 to...
In DepthDetails ArticlePubMed
TargetDihydrofolate reductase(Mycobacterium avium)
Harvard Medical School
LigandPNGBDBM18236(6-{2-[(2,4-diaminopteridin-6-yl)methyl]-2-azatricy...)
Affinity DataIC50:  6.30nM. Assay description: Dihydrofolate reductase was assayed with no inhibitor and with a series of concentrations of inhibitors to allow for a range of inhibition from 10 to...
In DepthDetails ArticlePubMed
TargetBifunctional dihydrofolate reductase-thymidylate synthase(Toxoplasma gondii)
Harvard Medical School
LigandPNGBDBM18236(6-{2-[(2,4-diaminopteridin-6-yl)methyl]-2-azatricy...)
Affinity DataIC50:  21nM. Assay description: Dihydrofolate reductase was assayed with no inhibitor and with a series of concentrations of inhibitors to allow for a range of inhibition from 10 to...
In DepthDetails ArticlePubMed