BDBM182565 US9145392, 266
SMILES Nc1ncnc(N2CCC(CC2)c2nc(cn2CCN2CCCC2)-c2ccc(Cl)c(F)c2)c1Br
InChI Key InChIKey=ZWIYTRXREXLLRD-UHFFFAOYSA-N
Data  2 IC50
  Tab Delimited (TSV)   2D SDfile   Computed 3D by Vconf -m prep SDfile
Find this compound or compounds like it in BindingDB:
Activity Spreadsheet -- Enzyme Inhibition Constant Data from BindingDB
Found 2 hits for monomerid = 182565
TargetRAC-alpha serine/threonine-protein kinase(Homo sapiens (Human))
Merck Patent
US Patent
LigandPNGBDBM182565(US9145392, 266)
Affinity DataIC50:  16nMpH: 7.5Assay Description:A TTP Mosquito liquid handling instrument is used to place 125n1 of the appropriate concentration of inhibitor in 100% DMSO (for a dose response curv...
In DepthDetails US Patent
TargetRibosomal protein S6 kinase beta-1(Homo sapiens (Human))
Merck Patent
US Patent
LigandPNGBDBM182565(US9145392, 266)
Affinity DataIC50:  3.30nMpH: 7.5 T: 2°C. Assay description: P70S6K inhibitor compounds are diluted and plated in 96 well plates. A reaction mixture including the following components is then added to the compo...
In DepthDetails US Patent