BDBM183074 US9150546, I-116::US9688643, I-116::US9718790, I-0116
SMILES CC(C)n1c(=O)nc(Nc2ccc(Oc3ccccc3)cc2)n(Cc2ccc(C)cc2)c1=O
InChI Key InChIKey=WTXITHIOEDHEDI-UHFFFAOYSA-N
Data  3 IC50
  Tab Delimited (TSV)   2D SDfile   Computed 3D by Vconf -m prep SDfile
Find this compound or compounds like it in BindingDB:
Activity Spreadsheet -- Enzyme Inhibition Constant Data from BindingDB
Found 3 hits for monomerid = 183074
TargetP2X purinoceptor 3(Homo sapiens (Human))
Shionogi
US Patent
LigandPNGBDBM183074(US9150546, I-116 | US9688643, I-116 | US9718790, I...)
Affinity DataIC50:  484nMpH: 7.5 T: 2°C. Assay description: Stably expressing cell line (C6BU-1 cell transfected with human P2X3 receptor gene (GenBank accession number Y07683)) was used. The cells were seeded...
In DepthDetails US Patent
TargetP2X purinoceptor 3(Homo sapiens (Human))
Shionogi
US Patent
LigandPNGBDBM183074(US9150546, I-116 | US9688643, I-116 | US9718790, I...)
Affinity DataIC50:  484nMpH: 7.5Assay Description:Stably expressing cell line (C6BU-1 transfected with human P2X3 receptor gene (GenBank accession number Y07683) was used. The cells were seeded in a ...
In DepthDetails US Patent
TargetP2X purinoceptor 3(Homo sapiens (Human))
Shionogi
US Patent
LigandPNGBDBM183074(US9150546, I-116 | US9688643, I-116 | US9718790, I...)
Affinity DataIC50:  484nM. Assay description: Stably expressing cell line (C6BU-1 cell transfected with human P2X3 receptor gene (GenBank accession number Y07683)) was used. The cells were seeded...
In DepthDetails US Patent