BDBM183286 US9150546, I-455::US9688643, I-455::US9718790, I-0464
SMILES CC(C)Oc1ccc(cc1F)\N=c1/[nH]c(=O)n(C[C@@H](C)C(O)=O)c(=O)n1Cc1ccc(Cl)cc1
InChI Key
Data  3 IC50
  Tab Delimited (TSV)   2D SDfile   Computed 3D by Vconf -m prep SDfile
Find this compound or compounds like it in BindingDB:
Activity Spreadsheet -- Enzyme Inhibition Constant Data from BindingDB
Found 3 hits for monomerid = 183286
TargetP2X purinoceptor 3(Homo sapiens (Human))
Shionogi
US Patent
LigandPNGBDBM183286(US9150546, I-455 | US9688643, I-455 | US9718790, I...)
Affinity DataIC50:  30nMpH: 7.5 T: 2°C. Assay description: Stably expressing cell line (C6BU-1 cell transfected with human P2X3 receptor gene (GenBank accession number Y07683)) was used. The cells were seeded...
In DepthDetails US Patent
TargetP2X purinoceptor 3(Homo sapiens (Human))
Shionogi
US Patent
LigandPNGBDBM183286(US9150546, I-455 | US9688643, I-455 | US9718790, I...)
Affinity DataIC50:  30nMpH: 7.5Assay Description:Stably expressing cell line (C6BU-1 transfected with human P2X3 receptor gene (GenBank accession number Y07683) was used. The cells were seeded in a ...
In DepthDetails US Patent
TargetP2X purinoceptor 3(Homo sapiens (Human))
Shionogi
US Patent
LigandPNGBDBM183286(US9150546, I-455 | US9688643, I-455 | US9718790, I...)
Affinity DataIC50:  30nM. Assay description: Stably expressing cell line (C6BU-1 cell transfected with human P2X3 receptor gene (GenBank accession number Y07683)) was used. The cells were seeded...
In DepthDetails US Patent