BDBM183397 US9145419, 7
SMILES Cc1ccncc1-c1ccnn2c(cnc12)-c1ccc(F)cc1
InChI Key InChIKey=ACEGOQOUKHTDCR-UHFFFAOYSA-N
Data  1 IC50
  Tab Delimited (TSV)   2D SDfile   Computed 3D by Vconf -m prep SDfile
Find this compound or compounds like it in BindingDB:
Activity Spreadsheet -- Enzyme Inhibition Constant Data from BindingDB
Found 1 hit for monomerid = 183397
TargetSteroid 17-alpha-hydroxylase/17,20 lyase(Homo sapiens (Human))
Bristol-Myers Squibb
US Patent
LigandPNGBDBM183397(US9145419, 7)
Affinity DataIC50:  56nMpH: 7.2 T: 2°C. Assay description: The assays were performed in U-bottom 384-well optiplates. The final assay volume was 15 μl prepared from 7.5 μl additions of microsomes (p...
In DepthDetails US Patent