BDBM18349 (2S,4S,5S,7S)-5-amino-4-hydroxy-7-{[4-methoxy-3-(4-methoxybutyl)phenyl]methyl}-8-methyl-N-[2-(morpholin-4-yl)ethyl]-2-(propan-2-yl)nonanamide::2,7-dialkyl-substituted 8-phenyl-octanecarboxamide, 59
SMILES COCCCCc1cc(C[C@@H](C[C@H](N)[C@@H](O)C[C@@H](C(C)C)C(=O)NCCN2CCOCC2)C(C)C)ccc1OC
InChI Key InChIKey=YPPZEAOHIDLQFO-KRCBVYEFSA-N
Data  1 IC50
  Tab Delimited (TSV)   2D SDfile   Computed 3D by Vconf -m prep SDfile
Find this compound or compounds like it in BindingDB:
Activity Spreadsheet -- Enzyme Inhibition Constant Data from BindingDB
Found 1 hit for monomerid = 18349
TargetRenin(Homo sapiens (Human))
Novartis Pharmaceuticals
LigandPNGBDBM18349((2S,4S,5S,7S)-5-amino-4-hydroxy-7-{[4-methoxy-3-(4...)
Affinity DataIC50:  2nM. Assay description: Enzyme inhibition by test compounds was determined using human recombinant renin, incubating with a synthetic tetradecapeptide substrate. The Ang I g...
In DepthDetails ArticlePubMed