BDBM183519 US9145354, 141
SMILES CC[C@@H](N[C@H](C)CC(N)=O)c1ccc(Cl)c(C(=O)c2ccc(nc2)C#N)c1F
InChI Key InChIKey=VEJYSJVSNNHPOC-BDJLRTHQSA-N
Data  1 IC50
  Tab Delimited (TSV)   2D SDfile   Computed 3D by Vconf -m prep SDfile
Find this compound or compounds like it in BindingDB:
Activity Spreadsheet -- Enzyme Inhibition Constant Data from BindingDB
Found 1 hit for monomerid = 183519
TargetGenome polyprotein(Hepatitis C virus (HCV genotype 1a, isolate H))
Astex Therapeutics
US Patent
LigandPNGBDBM183519(US9145354, 141)
Affinity DataIC50:  470nMT: 2°C. Assay description: The HCV NS3 protease functions have been extensively studied and are considered as potential targets for antiviral therapy: see for example the many ...
In DepthDetails US Patent