BDBM183654 US9150519, 1-30
SMILES CN(C1CCCCC1)c1cc(ncn1)C(=O)Nc1ccc(cc1)S(N)(=O)=O
InChI Key InChIKey=STAHAMMHAUKRKR-UHFFFAOYSA-N
Data  1 EC50
  Tab Delimited (TSV)   2D SDfile   Computed 3D by Vconf -m prep SDfile
Find this compound or compounds like it in BindingDB:
Activity Spreadsheet -- Enzyme Inhibition Constant Data from BindingDB
Found 1 hit for monomerid = 183654
TargetSphingosine 1-phosphate receptor 1(Homo sapiens (Human))
Merck Serono
US Patent
LigandPNGBDBM183654(US9150519, 1-30)
Affinity DataEC50:  674nMpH: 7.4 T: 2°C. Assay description: Measurements of 35S-GTPgammaS Binding: Membranes (1 to 10 µg protein) prepared as described above, were incubated in 96-well Scintiplates (PerkinElm...
In DepthDetails US Patent